Rename scoped_lock to openmp_scoped_lock

This avoids a collapse with std::scoped_lock.

This fixes issue #511.
6 jobs for master in 484 minutes and 15 seconds (queued for 4 minutes and 17 seconds)
Status Job ID Name Coverage
  Test
failed #3900
amd64
job_clang_amd64

00:28:39

failed #3904
amd64
job_clang_amd64_nosh

failed #3902
amd64
job_clang_py2_amd64

failed #3899
amd64
job_gcc_amd64

08:04:15

failed #3903
amd64
job_gcc_amd64_nosh

failed #3901
amd64
job_gcc_py2_amd64

06:58:58

 
Name Stage Failure
failed
job_gcc_amd64 Test
<string>:53: RuntimeWarning: More than 20 figures have been opened. Figures created through the pyplot interface (`matplotlib.pyplot.figure`) are retained until explicitly closed and may consume too much memory. (To control this warning, see the rcParam `figure.max_open_warning`).
<string>:1: RuntimeWarning: More than 20 figures have been opened. Figures created through the pyplot interface (`matplotlib.pyplot.figure`) are retained until explicitly closed and may consume too much memory. (To control this warning, see the rcParam `figure.max_open_warning`).
<string>:53: RuntimeWarning: More than 20 figures have been opened. Figures created through the pyplot interface (`matplotlib.pyplot.figure`) are retained until explicitly closed and may consume too much memory. (To control this warning, see the rcParam `figure.max_open_warning`).
<string>:1: RuntimeWarning: More than 20 figures have been opened. Figures created through the pyplot interface (`matplotlib.pyplot.figure`) are retained until explicitly closed and may consume too much memory. (To control this warning, see the rcParam `figure.max_open_warning`).
<string>:2: RuntimeWarning: More than 20 figures have been opened. Figures created through the pyplot interface (`matplotlib.pyplot.figure`) are retained until explicitly closed and may consume too much memory. (To control this warning, see the rcParam `figure.max_open_warning`).
<string>:12: UserWarning: tight_layout : falling back to Agg renderer
<string>:53: RuntimeWarning: More than 20 figures have been opened. Figures created through the pyplot interface (`matplotlib.pyplot.figure`) are retained until explicitly closed and may consume too much memory. (To control this warning, see the rcParam `figure.max_open_warning`).
bash: line 89: 25771 Segmentation fault (core dumped) python3 /usr/bin/sphinx-build -b doctest . build *.rst demos/inference/inference.rst
ERROR: Job failed: exit status 1
failed
job_gcc_py2_amd64 Test
$ export PYTHONPATH=$PWD/install/site-packages
$ cd doc; python2 /usr/bin/sphinx-build2 -b doctest . build *.rst demos/inference/inference.rst
Running Sphinx v1.8.5
Unable to init server: Could not connect: Connection refused
Unable to init server: Could not connect: Connection refused

Configuration error:
There is a syntax error in your configuration file: invalid syntax (uncertain_blockmodel.py, line 1011)
ERROR: Job failed: exit status 1
failed
job_clang_amd64_nosh Test There has been a timeout failure or the job got stuck. Check your timeout limits or try again
No job log
failed
job_gcc_amd64_nosh Test There has been a timeout failure or the job got stuck. Check your timeout limits or try again
No job log
failed
job_clang_py2_amd64 Test There has been a timeout failure or the job got stuck. Check your timeout limits or try again
No job log
failed
job_clang_amd64 Test
make[4]: Leaving directory '/var/lib/gitlab-runner/builds/c098b1de/3/count0/graph-tool/src/graph/dynamics'
make[3]: *** [Makefile:809: all-recursive] Error 1
make[3]: Leaving directory '/var/lib/gitlab-runner/builds/c098b1de/3/count0/graph-tool/src/graph'
make[2]: *** [Makefile:422: all-recursive] Error 1
make[2]: Leaving directory '/var/lib/gitlab-runner/builds/c098b1de/3/count0/graph-tool/src'
make[1]: *** [Makefile:594: all-recursive] Error 1
make[1]: Leaving directory '/var/lib/gitlab-runner/builds/c098b1de/3/count0/graph-tool'
make: *** [Makefile:481: all] Error 2
ERROR: Job failed: exit status 1