Merge branch 'master' into 'master'

Call cairo.get_include() to find py3cairo.h

See merge request !16
6 jobs for master in 549 minutes and 49 seconds (queued for 4 seconds)
Status Job ID Name Coverage
  Test
failed #3876
amd64
job_clang_amd64

00:28:52

failed #3880
amd64
job_clang_amd64_nosh

00:07:45

failed #3878
amd64
job_clang_py2_amd64

00:07:48

failed #3875
amd64
job_gcc_amd64

03:32:58

failed #3879
amd64
job_gcc_amd64_nosh

08:40:52

failed #3877
amd64
job_gcc_py2_amd64

03:04:03

 
Name Stage Failure
failed
job_gcc_amd64_nosh Test
    3 failures in tests
0 failures in setup code
0 failures in cleanup code
build finished with problems, 19 warnings.
<string>:53: RuntimeWarning: More than 20 figures have been opened. Figures created through the pyplot interface (`matplotlib.pyplot.figure`) are retained until explicitly closed and may consume too much memory. (To control this warning, see the rcParam `figure.max_open_warning`).
<string>:53: RuntimeWarning: More than 20 figures have been opened. Figures created through the pyplot interface (`matplotlib.pyplot.figure`) are retained until explicitly closed and may consume too much memory. (To control this warning, see the rcParam `figure.max_open_warning`).
<string>:53: RuntimeWarning: More than 20 figures have been opened. Figures created through the pyplot interface (`matplotlib.pyplot.figure`) are retained until explicitly closed and may consume too much memory. (To control this warning, see the rcParam `figure.max_open_warning`).
<string>:53: RuntimeWarning: More than 20 figures have been opened. Figures created through the pyplot interface (`matplotlib.pyplot.figure`) are retained until explicitly closed and may consume too much memory. (To control this warning, see the rcParam `figure.max_open_warning`).
ERROR: Job failed: exit status 1
failed
job_gcc_py2_amd64 Test
make[4]: Leaving directory '/var/lib/gitlab-runner/builds/c098b1de/1/count0/graph-tool/src/graph/inference'
make[3]: *** [Makefile:809: all-recursive] Error 1
make[3]: Leaving directory '/var/lib/gitlab-runner/builds/c098b1de/1/count0/graph-tool/src/graph'
make[2]: *** [Makefile:422: all-recursive] Error 1
make[2]: Leaving directory '/var/lib/gitlab-runner/builds/c098b1de/1/count0/graph-tool/src'
make[1]: *** [Makefile:594: all-recursive] Error 1
make[1]: Leaving directory '/var/lib/gitlab-runner/builds/c098b1de/1/count0/graph-tool'
make: *** [Makefile:481: all] Error 2
ERROR: Job failed: exit status 1
failed
job_gcc_amd64 Test
make[4]: Leaving directory '/var/lib/gitlab-runner/builds/c098b1de/6/count0/graph-tool/src/graph/inference'
make[3]: *** [Makefile:809: all-recursive] Error 1
make[3]: Leaving directory '/var/lib/gitlab-runner/builds/c098b1de/6/count0/graph-tool/src/graph'
make[2]: *** [Makefile:422: all-recursive] Error 1
make[2]: Leaving directory '/var/lib/gitlab-runner/builds/c098b1de/6/count0/graph-tool/src'
make[1]: *** [Makefile:594: all-recursive] Error 1
make[1]: Leaving directory '/var/lib/gitlab-runner/builds/c098b1de/6/count0/graph-tool'
make: *** [Makefile:481: all] Error 2
ERROR: Job failed: exit status 1
failed
job_clang_amd64_nosh Test
make[4]: Leaving directory '/var/lib/gitlab-runner/builds/c098b1de/3/count0/graph-tool/src/graph/dynamics'
make[3]: *** [Makefile:809: all-recursive] Error 1
make[3]: Leaving directory '/var/lib/gitlab-runner/builds/c098b1de/3/count0/graph-tool/src/graph'
make[2]: *** [Makefile:422: all-recursive] Error 1
make[2]: Leaving directory '/var/lib/gitlab-runner/builds/c098b1de/3/count0/graph-tool/src'
make[1]: *** [Makefile:594: all-recursive] Error 1
make[1]: Leaving directory '/var/lib/gitlab-runner/builds/c098b1de/3/count0/graph-tool'
make: *** [Makefile:481: all] Error 2
ERROR: Job failed: exit status 1
failed
job_clang_py2_amd64 Test
make[4]: Leaving directory '/var/lib/gitlab-runner/builds/c098b1de/5/count0/graph-tool/src/graph/dynamics'
make[3]: *** [Makefile:809: all-recursive] Error 1
make[3]: Leaving directory '/var/lib/gitlab-runner/builds/c098b1de/5/count0/graph-tool/src/graph'
make[2]: *** [Makefile:422: all-recursive] Error 1
make[2]: Leaving directory '/var/lib/gitlab-runner/builds/c098b1de/5/count0/graph-tool/src'
make[1]: *** [Makefile:594: all-recursive] Error 1
make[1]: Leaving directory '/var/lib/gitlab-runner/builds/c098b1de/5/count0/graph-tool'
make: *** [Makefile:481: all] Error 2
ERROR: Job failed: exit status 1
failed
job_clang_amd64 Test
make[4]: Leaving directory '/var/lib/gitlab-runner/builds/c098b1de/7/count0/graph-tool/src/graph/dynamics'
make[3]: *** [Makefile:809: all-recursive] Error 1
make[3]: Leaving directory '/var/lib/gitlab-runner/builds/c098b1de/7/count0/graph-tool/src/graph'
make[2]: *** [Makefile:422: all-recursive] Error 1
make[2]: Leaving directory '/var/lib/gitlab-runner/builds/c098b1de/7/count0/graph-tool/src'
make[1]: *** [Makefile:594: all-recursive] Error 1
make[1]: Leaving directory '/var/lib/gitlab-runner/builds/c098b1de/7/count0/graph-tool'
make: *** [Makefile:481: all] Error 2
ERROR: Job failed: exit status 1