Small improvements to sfdp_layout()

8 jobs for master
Status Job ID Name Coverage
  Test
failed #815
amd64
job_clang_amd64

00:00:56

failed #819
amd64
job_clang_amd64_nosh

00:01:04

failed #817
amd64
job_clang_py2_amd64

00:00:44

failed #812
i386
job_gcc_386

03:09:35

passed #814
amd64
job_gcc_amd64

02:29:33

passed #818
amd64
job_gcc_amd64_nosh

02:15:07

failed #813
i386
job_gcc_py2_386

03:07:55

passed #816
amd64
job_gcc_py2_amd64

02:28:02

 
Name Stage Failure
failed
job_clang_amd64_nosh Test There is an unknown failure, please try again
checking how to hardcode library paths into programs... immediate
checking for pkg-config... /usr/bin/pkg-config
checking pkg-config is at least version 0.9.0... yes
checking whether ccache clang++ supports C++14 features by default... no
checking whether ccache clang++ supports C++14 features with -std=gnu++14... no
checking whether ccache clang++ supports C++14 features with -std=gnu++0x... no
configure: error: *** A compiler with support for C++14 language features is required.

ERROR: Build failed with: exit status 1
failed
job_gcc_py2_386 Test There is an unknown failure, please try again
Doctest summary
===============
860 tests
1 failure in tests
0 failures in setup code
0 failures in cleanup code
build finished with problems, 137 warnings.

ERROR: Build failed with: exit status 1
failed
job_gcc_386 Test There is an unknown failure, please try again
  warnings.warn("tight_layout : falling back to Agg renderer")
/usr/lib/python3/dist-packages/matplotlib/tight_layout.py:222: UserWarning: tight_layout : falling back to Agg renderer
warnings.warn("tight_layout : falling back to Agg renderer")
/usr/lib/python3/dist-packages/matplotlib/tight_layout.py:222: UserWarning: tight_layout : falling back to Agg renderer
warnings.warn("tight_layout : falling back to Agg renderer")
/usr/lib/python3/dist-packages/matplotlib/tight_layout.py:222: UserWarning: tight_layout : falling back to Agg renderer
warnings.warn("tight_layout : falling back to Agg renderer")

ERROR: Build failed with: exit status 1
failed
job_clang_py2_amd64 Test There is an unknown failure, please try again
checking how to hardcode library paths into programs... immediate
checking for pkg-config... /usr/bin/pkg-config
checking pkg-config is at least version 0.9.0... yes
checking whether ccache clang++ supports C++14 features by default... no
checking whether ccache clang++ supports C++14 features with -std=gnu++14... no
checking whether ccache clang++ supports C++14 features with -std=gnu++0x... no
configure: error: *** A compiler with support for C++14 language features is required.

ERROR: Build failed with: exit status 1
failed
job_clang_amd64 Test There is an unknown failure, please try again
checking how to hardcode library paths into programs... immediate
checking for pkg-config... /usr/bin/pkg-config
checking pkg-config is at least version 0.9.0... yes
checking whether ccache clang++ supports C++14 features by default... no
checking whether ccache clang++ supports C++14 features with -std=gnu++14... no
checking whether ccache clang++ supports C++14 features with -std=gnu++0x... no
configure: error: *** A compiler with support for C++14 language features is required.

ERROR: Build failed with: exit status 1