Add generalized L^p norm to similarity()

6 jobs for master in 486 minutes and 50 seconds (queued for 2 seconds)
Status Job ID Name Coverage
  Test
passed job_clang_amd64 #3531
amd64

08:06:49

passed job_clang_amd64_nosh #3535
amd64

07:38:26

failed job_clang_py2_amd64 #3533
amd64

00:37:37

passed job_gcc_amd64 #3530
amd64

07:46:39

passed job_gcc_amd64_nosh #3534
amd64

07:28:04

failed job_gcc_py2_amd64 #3532
amd64

00:27:28

 
Name Stage Failure
failed
job_clang_py2_amd64 Test
make[4]: Leaving directory '/var/lib/gitlab-runner/builds/c098b1de/0/count0/graph-tool/src/graph/draw'
make[3]: *** [Makefile:752: all-recursive] Error 1
make[3]: Leaving directory '/var/lib/gitlab-runner/builds/c098b1de/0/count0/graph-tool/src/graph'
make[2]: *** [Makefile:422: all-recursive] Error 1
make[2]: Leaving directory '/var/lib/gitlab-runner/builds/c098b1de/0/count0/graph-tool/src'
make[1]: *** [Makefile:594: all-recursive] Error 1
make[1]: Leaving directory '/var/lib/gitlab-runner/builds/c098b1de/0/count0/graph-tool'
make: *** [Makefile:481: all] Error 2
ERROR: Job failed: exit status 1
failed
job_gcc_py2_amd64 Test
make[4]: Leaving directory '/var/lib/gitlab-runner/builds/c098b1de/3/count0/graph-tool/src/graph/draw'
make[3]: *** [Makefile:752: all-recursive] Error 1
make[3]: Leaving directory '/var/lib/gitlab-runner/builds/c098b1de/3/count0/graph-tool/src/graph'
make[2]: *** [Makefile:422: all-recursive] Error 1
make[2]: Leaving directory '/var/lib/gitlab-runner/builds/c098b1de/3/count0/graph-tool/src'
make[1]: *** [Makefile:594: all-recursive] Error 1
make[1]: Leaving directory '/var/lib/gitlab-runner/builds/c098b1de/3/count0/graph-tool'
make: *** [Makefile:481: all] Error 2
ERROR: Job failed: exit status 1