configure.ac: Remove prefix from numpy include

6 jobs for master in 1 minute and 26 seconds (queued for 3 seconds)
Status Job ID Name Coverage
  Test
failed #2316
amd64
job_clang_amd64

00:01:26

failed #2320
amd64
job_clang_amd64_nosh

00:01:25

failed #2318
amd64
job_clang_py2_amd64

00:01:25

failed #2315
amd64
job_gcc_amd64

00:01:25

failed #2319
amd64
job_gcc_amd64_nosh

00:01:24

failed #2317
amd64
job_gcc_py2_amd64

00:01:23

 
Name Stage Failure
failed
job_clang_amd64_nosh Test There is an unknown failure, please try again
checking for __gmpz_init in -lgmp... yes
checking for __gmpz_init in -lgmp... (cached) yes
checking whether CGAL is available in /usr... yes
checking whether to enable cgal debbuging with valgrind... no
checking python3.6 module: numpy... yes
./configure: line 20646: -I/usr/lib/python3.6/site-packages/numpy/core/include: No such file or directory
checking for numpy/arrayobject.h... no
configure: error: Numpy extension header not found
ERROR: Build failed: exit status 1
failed
job_gcc_amd64_nosh Test There is an unknown failure, please try again
checking for __gmpz_init in -lgmp... yes
checking for __gmpz_init in -lgmp... (cached) yes
checking whether CGAL is available in /usr... yes
checking whether to enable cgal debbuging with valgrind... no
checking python3.6 module: numpy... yes
./configure: line 20646: -I/usr/lib/python3.6/site-packages/numpy/core/include: No such file or directory
checking for numpy/arrayobject.h... no
configure: error: Numpy extension header not found
ERROR: Build failed: exit status 1
failed
job_clang_py2_amd64 Test There is an unknown failure, please try again
checking for __gmpz_init in -lgmp... yes
checking for __gmpz_init in -lgmp... (cached) yes
checking whether CGAL is available in /usr... yes
checking whether to enable cgal debbuging with valgrind... no
checking python2.7 module: numpy... yes
./configure: line 20646: -I/usr/lib/python2.7/site-packages/numpy/core/include: No such file or directory
checking for numpy/arrayobject.h... no
configure: error: Numpy extension header not found
ERROR: Build failed: exit status 1
failed
job_gcc_py2_amd64 Test There is an unknown failure, please try again
checking for __gmpz_init in -lgmp... yes
checking for __gmpz_init in -lgmp... (cached) yes
checking whether CGAL is available in /usr... yes
checking whether to enable cgal debbuging with valgrind... no
checking python2.7 module: numpy... yes
./configure: line 20646: -I/usr/lib/python2.7/site-packages/numpy/core/include: No such file or directory
checking for numpy/arrayobject.h... no
configure: error: Numpy extension header not found
ERROR: Build failed: exit status 1
failed
job_clang_amd64 Test There is an unknown failure, please try again
checking for __gmpz_init in -lgmp... yes
checking for __gmpz_init in -lgmp... (cached) yes
checking whether CGAL is available in /usr... yes
checking whether to enable cgal debbuging with valgrind... no
checking python3.6 module: numpy... yes
./configure: line 20646: -I/usr/lib/python3.6/site-packages/numpy/core/include: No such file or directory
checking for numpy/arrayobject.h... no
configure: error: Numpy extension header not found
ERROR: Build failed: exit status 1
failed
job_gcc_amd64 Test There is an unknown failure, please try again
checking for __gmpz_init in -lgmp... yes
checking for __gmpz_init in -lgmp... (cached) yes
checking whether CGAL is available in /usr... yes
checking whether to enable cgal debbuging with valgrind... no
checking python3.6 module: numpy... yes
./configure: line 20646: -I/usr/lib/python3.6/site-packages/numpy/core/include: No such file or directory
checking for numpy/arrayobject.h... no
configure: error: Numpy extension header not found
ERROR: Build failed: exit status 1