Slightly cleanup assortativity() and scalar_assortativity()

6 jobs for master in 1 minute and 18 seconds (queued for 1 second)
Status Name Job ID Coverage
  Test
failed job_clang_amd64 #2058
amd64

00:01:17

failed job_clang_amd64_nosh #2062
amd64

00:01:16

failed job_clang_py2_amd64 #2060
amd64

00:01:17

failed job_gcc_amd64 #2057
amd64

00:01:17

failed job_gcc_amd64_nosh #2061
amd64

00:01:17

failed job_gcc_py2_amd64 #2059
amd64

00:01:17

 
Name Stage Failure
failed
job_gcc_amd64 Test There is an unknown failure, please try again
configure.ac:22: installing './compile'
configure.ac:18: installing './config.guess'
configure.ac:18: installing './config.sub'
configure.ac:20: installing './install-sh'
configure.ac:20: installing './missing'
configure.ac:436: error: required file 'src/graph/community_old/Makefile.in' not found
src/graph/Makefile.am: installing './depcomp'
src/graph_tool/Makefile.am:3: installing './py-compile'
ERROR: Build failed: exit status 1
failed
job_clang_amd64 Test There is an unknown failure, please try again
configure.ac:22: installing './compile'
configure.ac:18: installing './config.guess'
configure.ac:18: installing './config.sub'
configure.ac:20: installing './install-sh'
configure.ac:20: installing './missing'
configure.ac:436: error: required file 'src/graph/community_old/Makefile.in' not found
src/graph/Makefile.am: installing './depcomp'
src/graph_tool/Makefile.am:3: installing './py-compile'
ERROR: Build failed: exit status 1
failed
job_clang_amd64_nosh Test There is an unknown failure, please try again
configure.ac:22: installing './compile'
configure.ac:18: installing './config.guess'
configure.ac:18: installing './config.sub'
configure.ac:20: installing './install-sh'
configure.ac:20: installing './missing'
configure.ac:436: error: required file 'src/graph/community_old/Makefile.in' not found
src/graph/Makefile.am: installing './depcomp'
src/graph_tool/Makefile.am:3: installing './py-compile'
ERROR: Build failed: exit status 1
failed
job_gcc_py2_amd64 Test There is an unknown failure, please try again
configure.ac:22: installing './compile'
configure.ac:18: installing './config.guess'
configure.ac:18: installing './config.sub'
configure.ac:20: installing './install-sh'
configure.ac:20: installing './missing'
configure.ac:436: error: required file 'src/graph/community_old/Makefile.in' not found
src/graph/Makefile.am: installing './depcomp'
src/graph_tool/Makefile.am:3: installing './py-compile'
ERROR: Build failed: exit status 1
failed
job_clang_py2_amd64 Test There is an unknown failure, please try again
configure.ac:22: installing './compile'
configure.ac:18: installing './config.guess'
configure.ac:18: installing './config.sub'
configure.ac:20: installing './install-sh'
configure.ac:20: installing './missing'
configure.ac:436: error: required file 'src/graph/community_old/Makefile.in' not found
src/graph/Makefile.am: installing './depcomp'
src/graph_tool/Makefile.am:3: installing './py-compile'
ERROR: Build failed: exit status 1
failed
job_gcc_amd64_nosh Test There is an unknown failure, please try again
configure.ac:22: installing './compile'
configure.ac:18: installing './config.guess'
configure.ac:18: installing './config.sub'
configure.ac:20: installing './install-sh'
configure.ac:20: installing './missing'
configure.ac:436: error: required file 'src/graph/community_old/Makefile.in' not found
src/graph/Makefile.am: installing './depcomp'
src/graph_tool/Makefile.am:3: installing './py-compile'
ERROR: Build failed: exit status 1